Reaction Details
TargetCell division cycle 7-related protein kinase/Protein DBF4 homolog A
LigandBDBM50365697
Substrate/Competitorn/a
Meas. Tech.ChEMBL_808454 (CHEMBL1961030)
Ki 5.4±n/a nM
Citation Woods, KWLai, CMiyashiro, JMTong, YFlorjancic, ASHan, EKSoni, NShi, YLasko, LLeverson, JDJohnson, EFShoemaker, ARPenning, TD Aminopyrimidinone cdc7 kinase inhibitors. Bioorg Med Chem Lett22:1940-3 (2012) 
 
Cell division cycle 7-related protein kinase/Protein DBF4 homolog A
Name:Cell division cycle 7-related protein kinase/Protein DBF4 homolog A
Type:Protein
Mol. Mass.:n/a
Description:n/a
Components:This complex has 2 components.
Component 1
Name:Protein DBF4 homolog A
Synonyms:ASK Chiffon homolog A DBF4-type zinc finger-containing protein 1 DBF4A_HUMAN ZDBF1
Type:Regulatory subunit
Mol. Mass.:76869.65
Organism:Homo sapiens (Human)
Description:n/a
Residue:674
Component 2
Name:Cell division cycle 7-related protein kinase
Synonyms:CDC7 CDC7L1 Cell division cycle 7-related protein kinase (CDC7) huCdc7
Type:Protein
Mol. Mass.:63908.16
Organism:Homo sapiens (Human)
Description:O00311
Residue:574
BDBM50365697
NameBDBM50365697
Synonyms:CHEMBL1958410
TypeSmall organic molecule
Emp. Form.C18H20N4O
Mol. Mass.308.3776
SMILESOc1cc(NC2CCCCC2)nc(c1)-c1c[nH]c2ncccc12