Reaction Details
TargetCarbonic anhydrase 2
LigandBDBM50366033
Substrate/Competitorn/a
Meas. Tech.ChEMBL_807338 (CHEMBL1960518)
Ki>200000±n/a nM
Citation Carta, FVullo, DMaresca, AScozzafava, ASupuran, CT New chemotypes acting as isozyme-selective carbonic anhydrase inhibitors with low affinity for the offtarget cytosolic isoform II. Bioorg Med Chem Lett22:2182-5 (2012) 
 
Carbonic anhydrase 2
Name:Carbonic anhydrase 2
Type:Enzyme
Mol. Mass.:29250.71
Organism:Homo sapiens (Human)
Description:P00918
Residue:260
BDBM50366033
NameBDBM50366033
Synonyms:ASUNTOL
TypeSmall organic molecule
Emp. Form.C14H16ClO5PS
Mol. Mass.362.766
SMILESCCOP(=S)(OCC)Oc1ccc2c(C)c(Cl)c(=O)oc2c1