Reaction Details
TargetCarbonic anhydrase 5B, mitochondrial
LigandBDBM50366033
Substrate/Competitorn/a
Meas. Tech.ChEMBL_807334 (CHEMBL1960514)
Ki 3410±n/a nM
Citation Carta, FVullo, DMaresca, AScozzafava, ASupuran, CT New chemotypes acting as isozyme-selective carbonic anhydrase inhibitors with low affinity for the offtarget cytosolic isoform II. Bioorg Med Chem Lett22:2182-5 (2012) 
 
Carbonic anhydrase 5B, mitochondrial
Name:Carbonic anhydrase 5B, mitochondrial
Type:Enzyme
Mol. Mass.:36440.83
Organism:Homo sapiens (Human)
Description:Human (cloned) isozyme
Residue:317
BDBM50366033
NameBDBM50366033
Synonyms:ASUNTOL
TypeSmall organic molecule
Emp. Form.C14H16ClO5PS
Mol. Mass.362.766
SMILESCCOP(=S)(OCC)Oc1ccc2c(C)c(Cl)c(=O)oc2c1