Reaction Details
TargetCarbonic anhydrase 14
LigandBDBM50366034
Substrate/Competitorn/a
Meas. Tech.ChEMBL_807328 (CHEMBL1960508)
Ki 36±n/a nM
Citation Carta, FVullo, DMaresca, AScozzafava, ASupuran, CT New chemotypes acting as isozyme-selective carbonic anhydrase inhibitors with low affinity for the offtarget cytosolic isoform II. Bioorg Med Chem Lett22:2182-5 (2012) 
 
Carbonic anhydrase 14
Name:Carbonic anhydrase 14
Type:Enzyme
Mol. Mass.:37665.67
Organism:Homo sapiens (Human)
Description:Human (cloned) isozyme.
Residue:337
BDBM50366034
NameBDBM50366034
Synonyms:CHEMBL186422
TypeSmall organic molecule
Emp. Form.C9H7NO
Mol. Mass.145.158
SMILESO=c1ccc2ccccc2[nH]1