Reaction Details
TargetCarbonic anhydrase 12
LigandBDBM50366035
Substrate/Competitorn/a
Meas. Tech.ChEMBL_807330 (CHEMBL1960510)
Ki 54±n/a nM
Citation Carta, FVullo, DMaresca, AScozzafava, ASupuran, CT New chemotypes acting as isozyme-selective carbonic anhydrase inhibitors with low affinity for the offtarget cytosolic isoform II. Bioorg Med Chem Lett22:2182-5 (2012) 
 
Carbonic anhydrase 12
Name:Carbonic anhydrase 12
Type:Enzyme
Mol. Mass.:39456.00
Organism:Homo sapiens (Human)
Description:Catalytic domain of human cloned isozyme was used in the assay
Residue:354
BDBM50366035
NameBDBM50366035
Synonyms:CHEMBL1956579
TypeSmall organic molecule
Emp. Form.C9H7NO2
Mol. Mass.161.1574
SMILESO\N=c1\ccc2ccccc2o1