Reaction Details
TargetCarbonic anhydrase 2
LigandBDBM50366036
Substrate/Competitorn/a
Meas. Tech.ChEMBL_807338 (CHEMBL1960518)
Ki>200000±n/a nM
Citation Carta, FVullo, DMaresca, AScozzafava, ASupuran, CT New chemotypes acting as isozyme-selective carbonic anhydrase inhibitors with low affinity for the offtarget cytosolic isoform II. Bioorg Med Chem Lett22:2182-5 (2012) 
 
Carbonic anhydrase 2
Name:Carbonic anhydrase 2
Type:Enzyme
Mol. Mass.:29250.71
Organism:Homo sapiens (Human)
Description:P00918
Residue:260
BDBM50366036
NameBDBM50366036
Synonyms:CHEMBL1956578
TypeSmall organic molecule
Emp. Form.C7H9NO2
Mol. Mass.139.1519
SMILESCc1cc(C)o\c(c1)=N\O