Reaction Details
TargetCarbonic anhydrase 5B, mitochondrial
LigandBDBM50366037
Substrate/Competitorn/a
Meas. Tech.ChEMBL_807334 (CHEMBL1960514)
Ki 2350±n/a nM
Citation Carta, FVullo, DMaresca, AScozzafava, ASupuran, CT New chemotypes acting as isozyme-selective carbonic anhydrase inhibitors with low affinity for the offtarget cytosolic isoform II. Bioorg Med Chem Lett22:2182-5 (2012) 
 
Carbonic anhydrase 5B, mitochondrial
Name:Carbonic anhydrase 5B, mitochondrial
Type:Enzyme
Mol. Mass.:36440.83
Organism:Homo sapiens (Human)
Description:Human (cloned) isozyme
Residue:317
BDBM50366037
NameBDBM50366037
Synonyms:CHEMBL1955873
TypeSmall organic molecule
Emp. Form.C7H6OS
Mol. Mass.138.187
SMILESOC(=S)c1ccccc1