Reaction Details
TargetCarbonic anhydrase 13
LigandBDBM50366037
Substrate/Competitorn/a
Meas. Tech.ChEMBL_807317 (CHEMBL1960497)
Ki 1310±n/a nM
Citation Carta, FVullo, DMaresca, AScozzafava, ASupuran, CT New chemotypes acting as isozyme-selective carbonic anhydrase inhibitors with low affinity for the offtarget cytosolic isoform II. Bioorg Med Chem Lett22:2182-5 (2012) 
 
Carbonic anhydrase 13
Name:Carbonic anhydrase 13
Type:Enzyme
Mol. Mass.:29445.78
Organism:Homo sapiens (Human)
Description:Q8N1Q1
Residue:262
BDBM50366037
NameBDBM50366037
Synonyms:CHEMBL1955873
TypeSmall organic molecule
Emp. Form.C7H6OS
Mol. Mass.138.187
SMILESOC(=S)c1ccccc1