Reaction Details
TargetEpidermal growth factor receptor
LigandBDBM50271906
Substrate/Competitorn/a
Meas. Tech.ChEMBL_807915 (CHEMBL1959298)
IC50 1670±n/a nM
Citation Gangjee, AZaware, NRaghavan, SYang, JThorpe, JEIhnat, MA N¿?¿-(3-Bromophenyl)-7-(substituted benzyl) pyrrolo[2,3-d]pyrimidines as potent multiple receptor tyrosine kinase inhibitors: design, synthesis, and in vivo evaluation. Bioorg Med Chem20:2444-54 (2012) 
 
Epidermal growth factor receptor
Name:Epidermal growth factor receptor
Type:Receptor Kinase Domain
Mol. Mass.:134279.59
Organism:Homo sapiens (Human)
Description:P00533
Residue:1210
BDBM50271906
NameBDBM50271906
Synonyms:2-benzyl-N4-(3-bromophenyl)-1H-indole-4,6-diamine CHEMBL499344
TypeSmall organic molecule
Emp. Form.C19H16BrN5
Mol. Mass.394.268
SMILESNc1nc(Nc2cccc(Br)c2)c2cc(Cc3ccccc3)[nH]c2n1