Reaction Details
TargetVascular endothelial growth factor receptor 1
LigandBDBM50292735
Substrate/Competitorn/a
Meas. Tech.ChEMBL_807914 (CHEMBL1959297)
IC50>50000±n/a nM
Citation Gangjee, AZaware, NRaghavan, SYang, JThorpe, JEIhnat, MA N¿?¿-(3-Bromophenyl)-7-(substituted benzyl) pyrrolo[2,3-d]pyrimidines as potent multiple receptor tyrosine kinase inhibitors: design, synthesis, and in vivo evaluation. Bioorg Med Chem20:2444-54 (2012) 
 
Vascular endothelial growth factor receptor 1
Name:Vascular endothelial growth factor receptor 1
Type:Receptor Tyrosine Kinase
Mol. Mass.:150800.23
Organism:Homo sapiens (Human)
Description:P17948
Residue:1338
BDBM50292735
NameBDBM50292735
Synonyms:CHEMBL514014 | N4-(3-bromophenyl)-6-(3,4,5-trimethoxybenzyl)-7H-pyrrolo[2,3-d]pyrimidine-2,4-diamine
TypeSmall organic molecule
Emp. Form.C22H22BrN5O3
Mol. Mass.484.346
SMILESCOc1cc(Cc2cc3c(Nc4cccc(Br)c4)nc(N)nc3[nH]2)cc(OC)c1OC