Reaction Details
TargetVascular endothelial growth factor receptor 1
LigandBDBM50366078
Substrate/Competitorn/a
Meas. Tech.ChEMBL_807914 (CHEMBL1959297)
IC50>50000±n/a nM
Citation Gangjee, AZaware, NRaghavan, SYang, JThorpe, JEIhnat, MA N¿?¿-(3-Bromophenyl)-7-(substituted benzyl) pyrrolo[2,3-d]pyrimidines as potent multiple receptor tyrosine kinase inhibitors: design, synthesis, and in vivo evaluation. Bioorg Med Chem20:2444-54 (2012) 
 
Vascular endothelial growth factor receptor 1
Name:Vascular endothelial growth factor receptor 1
Type:Receptor Tyrosine Kinase
Mol. Mass.:150800.23
Organism:Homo sapiens (Human)
Description:P17948
Residue:1338
BDBM50366078
NameBDBM50366078
Synonyms:CHEMBL1956886
TypeSmall organic molecule
Emp. Form.C19H14BrCl2N5
Mol. Mass.463.158
SMILESNc1nc(Nc2cccc(Br)c2)c2cc(Cc3ccc(Cl)c(Cl)c3)[nH]c2n1