Reaction Details
TargetVascular endothelial growth factor receptor 2
LigandBDBM50366079
Substrate/Competitorn/a
Meas. Tech.ChEMBL_807913 (CHEMBL1959296)
IC50 8280±n/a nM
Citation Gangjee, AZaware, NRaghavan, SYang, JThorpe, JEIhnat, MA N¿?¿-(3-Bromophenyl)-7-(substituted benzyl) pyrrolo[2,3-d]pyrimidines as potent multiple receptor tyrosine kinase inhibitors: design, synthesis, and in vivo evaluation. Bioorg Med Chem20:2444-54 (2012) 
 
Vascular endothelial growth factor receptor 2
Name:Vascular endothelial growth factor receptor 2
Type:Receptor Tyrosine Kinase
Mol. Mass.:151510.97
Organism:Homo sapiens (Human)
Description:P35968
Residue:1356
BDBM50366079
NameBDBM50366079
Synonyms:CHEMBL1956885
TypeSmall organic molecule
Emp. Form.C19H15BrClN5
Mol. Mass.428.713
SMILESNc1nc(Nc2cccc(Br)c2)c2cc(Cc3ccc(Cl)cc3)[nH]c2n1