Reaction Details
TargetEpidermal growth factor receptor
LigandBDBM50366084
Substrate/Competitorn/a
Meas. Tech.ChEMBL_807903 (CHEMBL1959286)
IC50>200000±n/a nM
Citation Gangjee, AZaware, NRaghavan, SYang, JThorpe, JEIhnat, MA N¿?¿-(3-Bromophenyl)-7-(substituted benzyl) pyrrolo[2,3-d]pyrimidines as potent multiple receptor tyrosine kinase inhibitors: design, synthesis, and in vivo evaluation. Bioorg Med Chem20:2444-54 (2012) 
 
Epidermal growth factor receptor
Name:Epidermal growth factor receptor
Type:Receptor Kinase Domain
Mol. Mass.:134279.59
Organism:Homo sapiens (Human)
Description:P00533
Residue:1210
BDBM50366084
NameBDBM50366084
Synonyms:CHEMBL1956895
TypeSmall organic molecule
Emp. Form.C23H18BrN5
Mol. Mass.444.327
SMILESNc1nc(Nc2cccc(Br)c2)c2ccn(Cc3cccc4ccccc34)c2n1