Reaction Details
TargetVascular endothelial growth factor receptor 1
LigandBDBM50366088
Substrate/Competitorn/a
Meas. Tech.ChEMBL_807902 (CHEMBL1959285)
IC50 99300±n/a nM
Citation Gangjee, AZaware, NRaghavan, SYang, JThorpe, JEIhnat, MA N¿?¿-(3-Bromophenyl)-7-(substituted benzyl) pyrrolo[2,3-d]pyrimidines as potent multiple receptor tyrosine kinase inhibitors: design, synthesis, and in vivo evaluation. Bioorg Med Chem20:2444-54 (2012) 
 
Vascular endothelial growth factor receptor 1
Name:Vascular endothelial growth factor receptor 1
Type:Receptor Tyrosine Kinase
Mol. Mass.:150800.23
Organism:Homo sapiens (Human)
Description:P17948
Residue:1338
BDBM50366088
NameBDBM50366088
Synonyms:CHEMBL1956888
TypeSmall organic molecule
Emp. Form.C19H16BrN5
Mol. Mass.394.268
SMILESNc1nc(Nc2cccc(Br)c2)c2ccn(Cc3ccccc3)c2n1