Reaction Details
TargetVascular endothelial growth factor receptor 1
LigandBDBM50366090
Substrate/Competitorn/a
Meas. Tech.ChEMBL_807902 (CHEMBL1959285)
IC50 79900±n/a nM
Citation Gangjee, AZaware, NRaghavan, SYang, JThorpe, JEIhnat, MA N¿?¿-(3-Bromophenyl)-7-(substituted benzyl) pyrrolo[2,3-d]pyrimidines as potent multiple receptor tyrosine kinase inhibitors: design, synthesis, and in vivo evaluation. Bioorg Med Chem20:2444-54 (2012) 
 
Vascular endothelial growth factor receptor 1
Name:Vascular endothelial growth factor receptor 1
Type:Receptor Tyrosine Kinase
Mol. Mass.:150800.23
Organism:Homo sapiens (Human)
Description:P17948
Residue:1338
BDBM50366090
NameBDBM50366090
Synonyms:CHEMBL1956891
TypeSmall organic molecule
Emp. Form.C19H15BrClN5
Mol. Mass.428.713
SMILESNc1nc(Nc2cccc(Br)c2)c2ccn(Cc3ccc(Cl)cc3)c2n1