Reaction Details
TargetVascular endothelial growth factor receptor 1
LigandBDBM4621
Substrate/Competitorn/a
Meas. Tech.ChEMBL_807902 (CHEMBL1959285)
IC50 17700±n/a nM
Citation Gangjee, AZaware, NRaghavan, SYang, JThorpe, JEIhnat, MA N¿?¿-(3-Bromophenyl)-7-(substituted benzyl) pyrrolo[2,3-d]pyrimidines as potent multiple receptor tyrosine kinase inhibitors: design, synthesis, and in vivo evaluation. Bioorg Med Chem20:2444-54 (2012) 
 
Vascular endothelial growth factor receptor 1
Name:Vascular endothelial growth factor receptor 1
Type:Receptor Tyrosine Kinase
Mol. Mass.:150800.23
Organism:Homo sapiens (Human)
Description:P17948
Residue:1338
BDBM4621
NameBDBM4621
Synonyms:Anilinoquinazoline deriv. 4 N-(4-chloro-2-fluorophenyl)-6,7-dimethoxyquinazolin-4-amine
TypeSmall organic molecule
Emp. Form.C16H13ClFN3O2
Mol. Mass.333.745
SMILESCOc1cc2ncnc(Nc3ccc(Cl)cc3F)c2cc1OC