Reaction Details
TargetVascular endothelial growth factor receptor 2
LigandBDBM50366085
Substrate/Competitorn/a
Meas. Tech.ChEMBL_807901 (CHEMBL1959284)
IC50 64500±n/a nM
Citation Gangjee, AZaware, NRaghavan, SYang, JThorpe, JEIhnat, MA N¿?¿-(3-Bromophenyl)-7-(substituted benzyl) pyrrolo[2,3-d]pyrimidines as potent multiple receptor tyrosine kinase inhibitors: design, synthesis, and in vivo evaluation. Bioorg Med Chem20:2444-54 (2012) 
 
Vascular endothelial growth factor receptor 2
Name:Vascular endothelial growth factor receptor 2
Type:Receptor Tyrosine Kinase
Mol. Mass.:151510.97
Organism:Homo sapiens (Human)
Description:P35968
Residue:1356
BDBM50366085
NameBDBM50366085
Synonyms:CHEMBL1956894
TypeSmall organic molecule
Emp. Form.C19H14BrCl2N5
Mol. Mass.463.158
SMILESNc1nc(Nc2cccc(Br)c2)c2ccn(Cc3ccc(Cl)c(Cl)c3)c2n1