Reaction Details
TargetVascular endothelial growth factor receptor 2
LigandBDBM50366081
Substrate/Competitorn/a
Meas. Tech.ChEMBL_807901 (CHEMBL1959284)
IC50 25700±n/a nM
Citation Gangjee, AZaware, NRaghavan, SYang, JThorpe, JEIhnat, MA N¿?¿-(3-Bromophenyl)-7-(substituted benzyl) pyrrolo[2,3-d]pyrimidines as potent multiple receptor tyrosine kinase inhibitors: design, synthesis, and in vivo evaluation. Bioorg Med Chem20:2444-54 (2012) 
 
Vascular endothelial growth factor receptor 2
Name:Vascular endothelial growth factor receptor 2
Type:Receptor Tyrosine Kinase
Mol. Mass.:151510.97
Organism:Homo sapiens (Human)
Description:P35968
Residue:1356
BDBM50366081
NameBDBM50366081
Synonyms:CHEMBL1956898
TypeSmall organic molecule
Emp. Form.C22H22BrN5O3
Mol. Mass.484.346
SMILESCOc1cc(Cn2ccc3c(Nc4cccc(Br)c4)nc(N)nc23)cc(OC)c1OC