Reaction Details
TargetVascular endothelial growth factor receptor 2
LigandBDBM4810
Substrate/Competitorn/a
Meas. Tech.ChEMBL_807901 (CHEMBL1959284)
IC50 2430±n/a nM
Citation Gangjee, AZaware, NRaghavan, SYang, JThorpe, JEIhnat, MA N¿?¿-(3-Bromophenyl)-7-(substituted benzyl) pyrrolo[2,3-d]pyrimidines as potent multiple receptor tyrosine kinase inhibitors: design, synthesis, and in vivo evaluation. Bioorg Med Chem20:2444-54 (2012) 
 
Vascular endothelial growth factor receptor 2
Name:Vascular endothelial growth factor receptor 2
Type:Receptor Tyrosine Kinase
Mol. Mass.:151510.97
Organism:Homo sapiens (Human)
Description:P35968
Residue:1356
BDBM4810
NameBDBM4810
Synonyms:(3Z)-3-[(3,5-dimethyl-1H-pyrrol-2-yl)methylidene]-2,3-dihydro-1H-indol-2-one CHEMBL276711 SU5416 US10189853, semaxanib US9422297, SU5416 | cid_5329098
TypeSmall organic molecule
Emp. Form.C15H14N2O
Mol. Mass.238.2845
SMILESCc1cc(C)c(\C=C2/C(=O)Nc3ccccc23)[nH]1