Reaction Details
TargetPlatelet-derived growth factor receptor beta
LigandBDBM50366084
Substrate/Competitorn/a
Meas. Tech.ChEMBL_807900 (CHEMBL1959283)
IC50 129300±n/a nM
Citation Gangjee, AZaware, NRaghavan, SYang, JThorpe, JEIhnat, MA N¿?¿-(3-Bromophenyl)-7-(substituted benzyl) pyrrolo[2,3-d]pyrimidines as potent multiple receptor tyrosine kinase inhibitors: design, synthesis, and in vivo evaluation. Bioorg Med Chem20:2444-54 (2012) 
 
Platelet-derived growth factor receptor beta
Name:Platelet-derived growth factor receptor beta
Type:Enzyme
Mol. Mass.:123922.25
Organism:Homo sapiens (Human)
Description:P09619
Residue:1106
BDBM50366084
NameBDBM50366084
Synonyms:CHEMBL1956895
TypeSmall organic molecule
Emp. Form.C23H18BrN5
Mol. Mass.444.327
SMILESNc1nc(Nc2cccc(Br)c2)c2ccn(Cc3cccc4ccccc34)c2n1