Reaction Details
TargetCarbonic anhydrase 1
LigandBDBM50366101
Substrate/Competitorn/a
Meas. Tech.ChEMBL_808110 (CHEMBL1961261)
Ki 8020±n/a nM
Citation Carta, FMaresca, AScozzafava, ASupuran, CT Novel coumarins and 2-thioxo-coumarins as inhibitors of the tumor-associated carbonic anhydrases IX and XII. Bioorg Med Chem20:2266-73 (2012) 
 
Carbonic anhydrase 1
Name:Carbonic anhydrase 1
Type:Enzyme
Mol. Mass.:28873.37
Organism:Homo sapiens (Human)
Description:P00915
Residue:261
BDBM50366101
NameBDBM50366101
Synonyms:CHEMBL1955879
TypeSmall organic molecule
Emp. Form.C9H6O2S
Mol. Mass.178.208
SMILESOc1ccc2ccc(=S)oc2c1