Reaction Details
TargetCarbonic anhydrase 1
LigandBDBM50366102
Substrate/Competitorn/a
Meas. Tech.ChEMBL_808110 (CHEMBL1961261)
Ki 30300±n/a nM
Citation Carta, FMaresca, AScozzafava, ASupuran, CT Novel coumarins and 2-thioxo-coumarins as inhibitors of the tumor-associated carbonic anhydrases IX and XII. Bioorg Med Chem20:2266-73 (2012) 
 
Carbonic anhydrase 1
Name:Carbonic anhydrase 1
Type:Enzyme
Mol. Mass.:28873.37
Organism:Homo sapiens (Human)
Description:P00915
Residue:261
BDBM50366102
NameBDBM50366102
Synonyms:CHEMBL1957172
TypeSmall organic molecule
Emp. Form.C12H10O3
Mol. Mass.202.206
SMILESC=CCOc1ccc2oc(=O)ccc2c1