Reaction Details
TargetCarbonic anhydrase 1
LigandBDBM50366110
Substrate/Competitorn/a
Meas. Tech.ChEMBL_808110 (CHEMBL1961261)
Ki 42900±n/a nM
Citation Carta, FMaresca, AScozzafava, ASupuran, CT Novel coumarins and 2-thioxo-coumarins as inhibitors of the tumor-associated carbonic anhydrases IX and XII. Bioorg Med Chem20:2266-73 (2012) 
 
Carbonic anhydrase 1
Name:Carbonic anhydrase 1
Type:Enzyme
Mol. Mass.:28873.37
Organism:Homo sapiens (Human)
Description:P00915
Residue:261
BDBM50366110
NameBDBM50366110
Synonyms:CHEMBL1957186
TypeSmall organic molecule
Emp. Form.C11H9FO3
Mol. Mass.208.1858
SMILESFCCOc1ccc2ccc(=O)oc2c1