Reaction Details
TargetCarbonic anhydrase 2
LigandBDBM50366096
Substrate/Competitorn/a
Meas. Tech.ChEMBL_808111 (CHEMBL1961262)
Ki>200000±n/a nM
Citation Carta, FMaresca, AScozzafava, ASupuran, CT Novel coumarins and 2-thioxo-coumarins as inhibitors of the tumor-associated carbonic anhydrases IX and XII. Bioorg Med Chem20:2266-73 (2012) 
 
Carbonic anhydrase 2
Name:Carbonic anhydrase 2
Type:Enzyme
Mol. Mass.:29250.71
Organism:Homo sapiens (Human)
Description:P00918
Residue:260
BDBM50366096
NameBDBM50366096
Synonyms:CHEMBL1957175
TypeSmall organic molecule
Emp. Form.C15H20O3Si
Mol. Mass.276.403
SMILESCC(C)(C)[Si](C)(C)Oc1ccc2oc(=O)ccc2c1