Reaction Details
TargetCarbonic anhydrase 2
LigandBDBM50366102
Substrate/Competitorn/a
Meas. Tech.ChEMBL_808111 (CHEMBL1961262)
Ki>200000±n/a nM
Citation Carta, FMaresca, AScozzafava, ASupuran, CT Novel coumarins and 2-thioxo-coumarins as inhibitors of the tumor-associated carbonic anhydrases IX and XII. Bioorg Med Chem20:2266-73 (2012) 
 
Carbonic anhydrase 2
Name:Carbonic anhydrase 2
Type:Enzyme
Mol. Mass.:29250.71
Organism:Homo sapiens (Human)
Description:P00918
Residue:260
BDBM50366102
NameBDBM50366102
Synonyms:CHEMBL1957172
TypeSmall organic molecule
Emp. Form.C12H10O3
Mol. Mass.202.206
SMILESC=CCOc1ccc2oc(=O)ccc2c1