Reaction Details
TargetCarbonic anhydrase 2
LigandBDBM50366108
Substrate/Competitorn/a
Meas. Tech.ChEMBL_808111 (CHEMBL1961262)
Ki>200000±n/a nM
Citation Carta, FMaresca, AScozzafava, ASupuran, CT Novel coumarins and 2-thioxo-coumarins as inhibitors of the tumor-associated carbonic anhydrases IX and XII. Bioorg Med Chem20:2266-73 (2012) 
 
Carbonic anhydrase 2
Name:Carbonic anhydrase 2
Type:Enzyme
Mol. Mass.:29250.71
Organism:Homo sapiens (Human)
Description:P00918
Residue:260
BDBM50366108
NameBDBM50366108
Synonyms:CHEMBL1957184
TypeSmall organic molecule
Emp. Form.C11H10O4
Mol. Mass.206.1947
SMILESOCCOc1ccc2ccc(=O)oc2c1