Reaction Details
TargetCarbonic anhydrase 9
LigandBDBM50366096
Substrate/Competitorn/a
Meas. Tech.ChEMBL_808112 (CHEMBL1961263)
Ki 800±n/a nM
Citation Carta, FMaresca, AScozzafava, ASupuran, CT Novel coumarins and 2-thioxo-coumarins as inhibitors of the tumor-associated carbonic anhydrases IX and XII. Bioorg Med Chem20:2266-73 (2012) 
 
Carbonic anhydrase 9
Name:Carbonic anhydrase 9
Type:Enzyme
Mol. Mass.:49669.03
Organism:Homo sapiens (Human)
Description:Catalytic domain of human cloned isozyme was used in the assay
Residue:459
BDBM50366096
NameBDBM50366096
Synonyms:CHEMBL1957175
TypeSmall organic molecule
Emp. Form.C15H20O3Si
Mol. Mass.276.403
SMILESCC(C)(C)[Si](C)(C)Oc1ccc2oc(=O)ccc2c1