Reaction Details
TargetCarbonic anhydrase 9
LigandBDBM50366101
Substrate/Competitorn/a
Meas. Tech.ChEMBL_808112 (CHEMBL1961263)
Ki 780±n/a nM
Citation Carta, FMaresca, AScozzafava, ASupuran, CT Novel coumarins and 2-thioxo-coumarins as inhibitors of the tumor-associated carbonic anhydrases IX and XII. Bioorg Med Chem20:2266-73 (2012) 
 
Carbonic anhydrase 9
Name:Carbonic anhydrase 9
Type:Enzyme
Mol. Mass.:49669.03
Organism:Homo sapiens (Human)
Description:Catalytic domain of human cloned isozyme was used in the assay
Residue:459
BDBM50366101
NameBDBM50366101
Synonyms:CHEMBL1955879
TypeSmall organic molecule
Emp. Form.C9H6O2S
Mol. Mass.178.208
SMILESOc1ccc2ccc(=S)oc2c1