Reaction Details
TargetCarbonic anhydrase 9
LigandBDBM50366113
Substrate/Competitorn/a
Meas. Tech.ChEMBL_808112 (CHEMBL1961263)
Ki 970±n/a nM
Citation Carta, FMaresca, AScozzafava, ASupuran, CT Novel coumarins and 2-thioxo-coumarins as inhibitors of the tumor-associated carbonic anhydrases IX and XII. Bioorg Med Chem20:2266-73 (2012) 
 
Carbonic anhydrase 9
Name:Carbonic anhydrase 9
Type:Enzyme
Mol. Mass.:49669.03
Organism:Homo sapiens (Human)
Description:Catalytic domain of human cloned isozyme was used in the assay
Residue:459
BDBM50366113
NameBDBM50366113
Synonyms:CHEMBL1957188
TypeSmall organic molecule
Emp. Form.C15H17NO4
Mol. Mass.275.2998
SMILESCc1cc(=O)oc2cc(NC(=O)OC(C)(C)C)ccc12