Reaction Details
TargetCarbonic anhydrase 9
LigandBDBM71742
Substrate/Competitorn/a
Meas. Tech.ChEMBL_808112 (CHEMBL1961263)
Ki 7640±n/a nM
Citation Carta, FMaresca, AScozzafava, ASupuran, CT Novel coumarins and 2-thioxo-coumarins as inhibitors of the tumor-associated carbonic anhydrases IX and XII. Bioorg Med Chem20:2266-73 (2012) 
 
Carbonic anhydrase 9
Name:Carbonic anhydrase 9
Type:Enzyme
Mol. Mass.:49669.03
Organism:Homo sapiens (Human)
Description:Catalytic domain of human cloned isozyme was used in the assay
Residue:459
BDBM71742
NameBDBM71742
Synonyms:7-amino-4-methyl-1-benzopyran-2-one 7-amino-4-methylchromen-2-one EN300-05587 SMR000067752 | cid_92249
TypeSmall organic molecule
Emp. Form.C10H9NO2
Mol. Mass.175.184
SMILESCc1cc(=O)oc2cc(N)ccc12