Reaction Details
TargetCarbonic anhydrase 12
LigandBDBM50366103
Substrate/Competitorn/a
Meas. Tech.ChEMBL_808113 (CHEMBL1961264)
Ki 640±n/a nM
Citation Carta, FMaresca, AScozzafava, ASupuran, CT Novel coumarins and 2-thioxo-coumarins as inhibitors of the tumor-associated carbonic anhydrases IX and XII. Bioorg Med Chem20:2266-73 (2012) 
 
Carbonic anhydrase 12
Name:Carbonic anhydrase 12
Type:Enzyme
Mol. Mass.:39456.00
Organism:Homo sapiens (Human)
Description:Catalytic domain of human cloned isozyme was used in the assay
Residue:354
BDBM50366103
NameBDBM50366103
Synonyms:CHEMBL432745
TypeSmall organic molecule
Emp. Form.C12H10O3
Mol. Mass.202.206
SMILESC=CCOc1ccc2ccc(=O)oc2c1