Reaction Details
TargetCarbonic anhydrase 12
LigandBDBM71742
Substrate/Competitorn/a
Meas. Tech.ChEMBL_808113 (CHEMBL1961264)
Ki 9130±n/a nM
Citation Carta, FMaresca, AScozzafava, ASupuran, CT Novel coumarins and 2-thioxo-coumarins as inhibitors of the tumor-associated carbonic anhydrases IX and XII. Bioorg Med Chem20:2266-73 (2012) 
 
Carbonic anhydrase 12
Name:Carbonic anhydrase 12
Type:Enzyme
Mol. Mass.:39456.00
Organism:Homo sapiens (Human)
Description:Catalytic domain of human cloned isozyme was used in the assay
Residue:354
BDBM71742
NameBDBM71742
Synonyms:7-amino-4-methyl-1-benzopyran-2-one 7-amino-4-methylchromen-2-one EN300-05587 SMR000067752 | cid_92249
TypeSmall organic molecule
Emp. Form.C10H9NO2
Mol. Mass.175.184
SMILESCc1cc(=O)oc2cc(N)ccc12