Reaction Details
TargetProstaglandin E2 receptor EP2 subtype
LigandBDBM50366137
Substrate/Competitorn/a
Meas. Tech.ChEMBL_808314 (CHEMBL1961331)
Ki 1.7±n/a nM
Citation Kambe, TMaruyama, TNakai, YYoshida, HOida, HMaruyama, TAbe, NNishiura, ANakai, HToda, M Discovery of novel prostaglandin analogs as potent and selective EP2/EP4 dual agonists. Bioorg Med Chem20:2235-51 (2012) 
 
Prostaglandin E2 receptor EP2 subtype
Name:Prostaglandin E2 receptor EP2 subtype
Type:G-protein coupled receptor
Mol. Mass.:40495.26
Organism:Mus musculus (Mouse)
Description:n/a
Residue:362
BDBM50366137
NameBDBM50366137
Synonyms:CHEMBL1957436
TypeSmall organic molecule
Emp. Form.C26H25ClN2O4S2
Mol. Mass.529.071
SMILESO[C@@H](Cc1cccc(c1)-c1ccc(Cl)cc1)\C=C\[C@H]1CCC(=O)N1CCSc1nc(cs1)C(O)=O