Reaction Details
TargetProstaglandin E2 receptor EP4 subtype
LigandBDBM50360626
Substrate/Competitorn/a
Meas. Tech.ChEMBL_808316 (CHEMBL1961333)
Ki 0.41±n/a nM
Citation Kambe, TMaruyama, TNakai, YYoshida, HOida, HMaruyama, TAbe, NNishiura, ANakai, HToda, M Discovery of novel prostaglandin analogs as potent and selective EP2/EP4 dual agonists. Bioorg Med Chem20:2235-51 (2012) 
 
Prostaglandin E2 receptor EP4 subtype
Name:Prostaglandin E2 receptor EP4 subtype
Type:G-protein coupled receptor
Mol. Mass.:56175.66
Organism:Mus musculus (Mouse)
Description:n/a
Residue:513
BDBM50360626
NameBDBM50360626
Synonyms:CHEMBL1933722
TypeSmall organic molecule
Emp. Form.C21H24N2O4S2
Mol. Mass.432.556
SMILESCc1cccc(C[C@H](O)\C=C\[C@H]2CCC(=O)N2CCSc2nc(cs2)C(O)=O)c1