Reaction Details
TargetNuclear receptor subfamily 1 group D member 2
LigandBDBM50366238
Substrate/Competitorn/a
Meas. Tech.ChEMBL_808915 (CHEMBL1961799)
IC50 800±n/a nM
Citation Solt, LAWang, YBanerjee, SHughes, TKojetin, DJLundasen, TShin, YLiu, JCameron, MDNoel, RYoo, SHTakahashi, JSButler, AAKamenecka, TMBurris, TP Regulation of circadian behaviour and metabolism by synthetic REV-ERB agonists. Nature485:62-68 (2012) 
 
Nuclear receptor subfamily 1 group D member 2
Name:Nuclear receptor subfamily 1 group D member 2
Type:PROTEIN
Mol. Mass.:64639.08
Organism:Homo sapiens (Human)
Description:ChEMBL_1502200
Residue:579
BDBM50366238
NameBDBM50366238
Synonyms:CHEMBL1961796
TypeSmall organic molecule
Emp. Form.C20H24ClN3O4S
Mol. Mass.437.94
SMILESCCOC(=O)N1CCC(CN(Cc2ccc(s2)[N+]([O-])=O)Cc2ccc(Cl)cc2)C1