Reaction Details
TargetD(2) dopamine receptor
LigandBDBM50137976
Substrate/Competitorn/a
Meas. Tech.ChEBML_62880
Ki 17±n/a nM
Citation Campiani, GButini, SFattorusso, CCatalanotti, BGemma, SNacci, VMorelli, ECagnotto, AMereghetti, IMennini, TCarli, MMinetti, PDi Cesare, MAMastroianni, DScafetta, NGalletti, BStasi, MACastorina, MPacifici, LVertechy, MDi Serio, SGhirardi, OTinti, OCarminati, P Pyrrolo[1,3]benzothiazepine-based serotonin and dopamine receptor antagonists. Molecular modeling, further structure-activity relationship studies, and identification of novel atypical antipsychotic agents. J Med Chem47:143-57 (2003) 
 
D(2) dopamine receptor
Name:D(2) dopamine receptor
Type:G Protein-Coupled Receptor (GPCR)
Mol. Mass.:50931.60
Organism:Rattus norvegicus (rat)
Description:P61169
Residue:444
BDBM50137976
NameBDBM50137976
Synonyms:9-(4-Methyl-piperazin-1-yl)-4-thia-10a-aza-benzo[f]azulene | CHEMBL367045
TypeSmall organic molecule
Emp. Form.C17H19N3S
Mol. Mass.297.418
SMILESCN1CCN(CC1)C1=Cn2cccc2Sc2ccccc12