Reaction Details
TargetD(1A) dopamine receptor
LigandBDBM50137975
Substrate/Competitorn/a
Meas. Tech.ChEBML_58674
Ki 3.4±n/a nM
Citation Campiani, GButini, SFattorusso, CCatalanotti, BGemma, SNacci, VMorelli, ECagnotto, AMereghetti, IMennini, TCarli, MMinetti, PDi Cesare, MAMastroianni, DScafetta, NGalletti, BStasi, MACastorina, MPacifici, LVertechy, MDi Serio, SGhirardi, OTinti, OCarminati, P Pyrrolo[1,3]benzothiazepine-based serotonin and dopamine receptor antagonists. Molecular modeling, further structure-activity relationship studies, and identification of novel atypical antipsychotic agents. J Med Chem47:143-57 (2003) 
 
D(1A) dopamine receptor
Name:D(1A) dopamine receptor
Type:Enzyme Catalytic Domain
Mol. Mass.:49429.75
Organism:RAT
Description:P18901
Residue:446
BDBM50137975
NameBDBM50137975
Synonyms:7-Bromo-9-(4-methyl-piperazin-1-yl)-4-thia-10a-aza-benzo[f]azulene | CHEMBL369367
TypeSmall organic molecule
Emp. Form.C17H18BrN3S
Mol. Mass.376.314
SMILESCN1CCN(CC1)C1=Cn2cccc2Sc2ccc(Br)cc12