Reaction Details
TargetD(2) dopamine receptor
LigandBDBM50137982
Substrate/Competitorn/a
Meas. Tech.ChEBML_62880
Ki 3.5±n/a nM
Citation Campiani, GButini, SFattorusso, CCatalanotti, BGemma, SNacci, VMorelli, ECagnotto, AMereghetti, IMennini, TCarli, MMinetti, PDi Cesare, MAMastroianni, DScafetta, NGalletti, BStasi, MACastorina, MPacifici, LVertechy, MDi Serio, SGhirardi, OTinti, OCarminati, P Pyrrolo[1,3]benzothiazepine-based serotonin and dopamine receptor antagonists. Molecular modeling, further structure-activity relationship studies, and identification of novel atypical antipsychotic agents. J Med Chem47:143-57 (2003) 
 
D(2) dopamine receptor
Name:D(2) dopamine receptor
Type:G Protein-Coupled Receptor (GPCR)
Mol. Mass.:50931.60
Organism:Rattus norvegicus (rat)
Description:P61169
Residue:444
BDBM50137982
NameBDBM50137982
Synonyms:7-Chloro-9-(4-methyl-[1,4]diazepan-1-yl)-4-thia-10a-aza-benzo[f]azulene | CHEMBL177455
TypeSmall organic molecule
Emp. Form.C18H20ClN3S
Mol. Mass.345.89
SMILESCN1CCCN(CC1)C1=Cn2cccc2Sc2ccc(Cl)cc12