Reaction Details
Target5-hydroxytryptamine receptor 2A
LigandBDBM50137976
Substrate/Competitorn/a
Meas. Tech.ChEBML_2306
Ki 1.1±n/a nM
Citation Campiani, GButini, SFattorusso, CCatalanotti, BGemma, SNacci, VMorelli, ECagnotto, AMereghetti, IMennini, TCarli, MMinetti, PDi Cesare, MAMastroianni, DScafetta, NGalletti, BStasi, MACastorina, MPacifici, LVertechy, MDi Serio, SGhirardi, OTinti, OCarminati, P Pyrrolo[1,3]benzothiazepine-based serotonin and dopamine receptor antagonists. Molecular modeling, further structure-activity relationship studies, and identification of novel atypical antipsychotic agents. J Med Chem47:143-57 (2003) 
 
5-hydroxytryptamine receptor 2A
Name:5-hydroxytryptamine receptor 2A
Type:undefined
Mol. Mass.:52607.65
Organism:Homo sapiens (Human)
Description:P28223
Residue:471
BDBM50137976
NameBDBM50137976
Synonyms:9-(4-Methyl-piperazin-1-yl)-4-thia-10a-aza-benzo[f]azulene | CHEMBL367045
TypeSmall organic molecule
Emp. Form.C17H19N3S
Mol. Mass.297.418
SMILESCN1CCN(CC1)C1=Cn2cccc2Sc2ccccc12