Reaction Details
TargetAdenosine receptor A2a/A2b
LigandBDBM50009552
Substrate/Competitorn/a
Meas. Tech.ChEMBL_30560 (CHEMBL649872)
Ki 363±n/a nM
Citation Nair, VFesbender, AJMiller, LPBruce, JL High selectivity of novel isoguanosine analogues for the adenosine A1 receptor Bioorg Med Chem Lett1:481-486 (1991)    Article
 
Adenosine receptor A2a/A2b
Name:Adenosine receptor A2a/A2b
Synonyms:Adenosine A2 receptor
Type:n/a
Mol. Mass.:n/a
Description:ASSAY_ID of ChEMBL is 30560
Components:This complex has 2 components.
Component 1
Name:Adenosine receptor A2b
Type:PROTEIN
Mol. Mass.:36378.84
Organism:Rattus norvegicus
Description:ChEMBL_32934
Residue:332
Component 2
Name:Adenosine receptor A2a
Synonyms:AA2AR_RAT Adenosine A2 receptor Adenosine Receptors A2a (A2a) Adenosine receptors A2a Rat striatal adenosine A2a receptor
Type:G Protein-Coupled Receptor (GPCR)
Mol. Mass.:45015.65
Organism:Rattus norvegicus (rat)
Description:Rat A2A receptors expressed in CHO cells.
Residue:410
BDBM50009552
NameBDBM50009552
Synonyms:2-[6-Amino-2-(2-morpholin-4-yl-ethylamino)-purin-9-yl]-5-hydroxymethyl-tetrahydro-furan-3,4-diol CHEMBL45891 | N6-Cyclohexylado (CHA)
TypeSmall organic molecule
Emp. Form.C16H23N5O4
Mol. Mass.349.3849
SMILESOC[C@H]1O[C@H]([C@H](O)[C@@H]1O)n1cnc2c(NC3CCCCC3)ncnc12