Reaction Details
Target5-hydroxytryptamine receptor 3A
LigandBDBM50005836
Substrate/Competitorn/a
Meas. Tech.ChEBML_3404
Ki 1500±n/a nM
Citation Flynn, DLBecker, DPSpangler, DPNosal, RGullikson, GWMoummi, CYang, D New aza(nor)adamantanes are agonists at the newly identified serotonin 5-HT4 receptor and antagonists at the 5-HT3 receptor Bioorg Med Chem Lett2:1613-1618 (1992)    Article
 
5-hydroxytryptamine receptor 3A
Name:5-hydroxytryptamine receptor 3A
Type:Enzyme Catalytic Domain
Mol. Mass.:55428.70
Organism:RAT
Description:5-HT3 HTR3A RAT::P35563
Residue:483
BDBM50005836
NameBDBM50005836
Synonyms:4-Amino-5-chloro-N-{1-[3-(4-fluoro-phenoxy)-propyl]-3-methoxy-piperidin-4-yl}-2-methoxy-benzamide CHEMBL560739 PROPULSID US10800776, Example Cisapride cid_5311047
TypeSmall organic molecule
Emp. Form.C23H29ClFN3O4
Mol. Mass.465.945
SMILESCOC1CN(CCCOc2ccc(F)cc2)CCC1NC(=O)c1cc(Cl)c(N)cc1OC