Reaction Details
TargetLeukotriene B4 receptor 1
LigandBDBM81519
Substrate/Competitorn/a
Meas. Tech.ChEMBL_98512 (CHEMBL706534)
IC50 85±n/a nM
Citation Scott Sawyer, JBaldwin, RFFroelich, LLSaussy, DLJackson, WT Synthesis and pharmacologic activity of hydroxyacetophenone-substituted benzophenone/xanthone leukotriene B4 receptor antagonists Bioorg Med Chem Lett3:1981-1984 (1993)    Article
 
Leukotriene B4 receptor 1
Name:Leukotriene B4 receptor 1
Type:Enzyme Catalytic Domain
Mol. Mass.:37582.68
Organism:Homo sapiens (Human)
Description:Q15722
Residue:352
BDBM81519
NameBDBM81519
Synonyms:CAS_117690-79-6 CHEMBL15766 | LY 255283
TypeSmall organic molecule
Emp. Form.C19H28N4O3
Mol. Mass.360.4506
SMILESCCc1cc(C(C)=O)c(O)cc1OCCCCCC(C)(C)c1nnn[nH]1