Reaction Details
TargetLeukotriene B4 receptor 1
LigandBDBM50001611
Substrate/Competitorn/a
Meas. Tech.ChEBML_98512
Ki 7.8±n/a nM
Citation Scott Sawyer, JBaldwin, RFFroelich, LLSaussy, DLJackson, WT Synthesis and pharmacologic activity of hydroxyacetophenone-substituted benzophenone/xanthone leukotriene B4 receptor antagonists Bioorg Med Chem Lett3:1981-1984 (1993)    Article
 
Leukotriene B4 receptor 1
Name:Leukotriene B4 receptor 1
Type:Enzyme Catalytic Domain
Mol. Mass.:37582.68
Organism:Homo sapiens (Human)
Description:Q15722
Residue:352
BDBM50001611
NameBDBM50001611
Synonyms:(E)-3-{3-(2-Carboxy-ethyl)-4-[6-(4-methoxy-phenyl)-hex-5-enyloxy]-benzoyl}-benzoic acid 3-{3-(2-Carboxy-ethyl)-4-[(E)-6-(4-methoxy-phenyl)-hex-5-enyloxy]-benzoyl}-benzoic acid 3-{3-(2-Carboxy-ethyl)-4-[6-(4-methoxy-phenyl)-hex-5-enyloxy]-benzoyl}-benzoic acid (BT223982) CHEMBL49302 | LY-223982
TypeSmall organic molecule
Emp. Form.C30H30O7
Mol. Mass.502.555
SMILESCOc1ccc(\C=C\CCCCOc2ccc(cc2CCC(O)=O)C(=O)c2cccc(c2)C(O)=O)cc1