Reaction Details
TargetNeurotensin receptor type 1
LigandBDBM50281812
Substrate/Competitorn/a
Meas. Tech.ChEBML_144304
Ki 82±n/a nM
Citation Cain, GAChristos, TEJohnson, ALPottorf, RSConfalone, PNWilliam Tam, SSchmidt, WK Neurotensin receptor binding and antinociceptive activity for lipophilic N-amido neurotensin(913) analogs Bioorg Med Chem Lett3:2055-2060 (1993)    Article
 
Neurotensin receptor type 1
Name:Neurotensin receptor type 1
Type:PROTEIN
Mol. Mass.:47070.64
Organism:Rattus norvegicus
Description:ChEMBL_1466612
Residue:424
BDBM50281812
NameBDBM50281812
Synonyms:(S)-2-{(2S,3S)-2-[(S)-2-{[(S)-1-((S)-5-Amino-2-tert-butoxycarbonylamino-pentanoyl)-pyrrolidine-2-carbonyl]-amino}-3-(4-hydroxy-phenyl)-propionylamino]-3-methyl-pentanoylamino}-4-methyl-pentanoic acid | CHEMBL427656
TypeSmall organic molecule
Emp. Form.C36H58N6O9
Mol. Mass.718.8805
SMILESCC[C@H](C)[C@H](NC(=O)[C@H](Cc1ccc(O)cc1)NC(=O)[C@@H]1CCCN1C(=O)[C@H](CCCN)NC(=O)OC(C)(C)C)C(=O)N[C@@H](CC(C)C)C(O)=O