Reaction Details
Target3-phosphoshikimate 1-carboxyvinyltransferase
LigandBDBM50283584
Substrate/Competitorn/a
Meas. Tech.ChEMBL_64948 (CHEMBL675693)
IC50 3000000±n/a nM
Citation Miller, MJBraccolino, DSClearly, DGReam, JEWalker, MCSikorski, JA EPSP synthase inhibitor design IV. New aromatic substrate analogs and symmetrical inhibitors containing novel 3-phosphate mimics. Bioorg Med Chem Lett4:2605-2608 (1994)    Article
 
3-phosphoshikimate 1-carboxyvinyltransferase
Name:3-phosphoshikimate 1-carboxyvinyltransferase
Type:PROTEIN
Mol. Mass.:46089.22
Organism:Escherichia coli (strain K12)
Description:ChEMBL_65087
Residue:427
BDBM50283584
NameBDBM50283584
Synonyms:CHEMBL88887 | disodium hydrogen 3-carboxy-5-[(hydroxyphosphinato)methyl]benzylphosphonate
TypeSmall organic molecule
Emp. Form.C9H10O8P2
Mol. Mass.308.1195
SMILESOC(=O)c1cc(CP(O)([O-])=O)cc(CP(O)([O-])=O)c1