Reaction Details
Target3-phosphoshikimate 1-carboxyvinyltransferase
LigandBDBM50283579
Substrate/Competitorn/a
Meas. Tech.ChEMBL_64952 (CHEMBL857525)
Ki 780±n/a nM
Citation Miller, MJBraccolino, DSClearly, DGReam, JEWalker, MCSikorski, JA EPSP synthase inhibitor design IV. New aromatic substrate analogs and symmetrical inhibitors containing novel 3-phosphate mimics. Bioorg Med Chem Lett4:2605-2608 (1994)    Article
 
3-phosphoshikimate 1-carboxyvinyltransferase
Name:3-phosphoshikimate 1-carboxyvinyltransferase
Type:PROTEIN
Mol. Mass.:46089.22
Organism:Escherichia coli (strain K12)
Description:ChEMBL_65087
Residue:427
BDBM50283579
NameBDBM50283579
Synonyms:CHEMBL314675 | Di sodium;3,5-Bis-phosphonooxy-benzoate
TypeSmall organic molecule
Emp. Form.C7H6O10P2
Mol. Mass.312.0652
SMILESOC(=O)c1cc(OP(O)([O-])=O)cc(OP(O)([O-])=O)c1