Reaction Details
TargetNeprilysin
LigandBDBM50283635
Substrate/Competitorn/a
Meas. Tech.ChEBML_144632
IC50 37±n/a nM
Citation De Lombaert, STan, JStamford, LJSakane, YBerry, CGhai, RD Dual inhibition of neutral endopeptidase and angiotensin-converting enzyme by N-phosphonomethyl and N-carboxyalkyl dipeptides Bioorg Med Chem Lett4:2715-2720 (1994)    Article
 
Neprilysin
Name:Neprilysin
Type:Enzyme
Mol. Mass.:85505.38
Organism:Homo sapiens (Human)
Description:P08473
Residue:750
BDBM50283635
NameBDBM50283635
Synonyms:(S)-3-Biphenyl-4-yl-2-[(S)-2-(phosphonomethyl-amino)-hexanoylamino]-propionic acid | CHEMBL313419
TypeSmall organic molecule
Emp. Form.C22H29N2O6P
Mol. Mass.448.4492
SMILESCCCC[C@H](NCP(O)(O)=O)C(=O)N[C@@H](Cc1ccc(cc1)-c1ccccc1)C(O)=O