Reaction Details
TargetNeprilysin
LigandBDBM50283636
Substrate/Competitorn/a
Meas. Tech.ChEBML_144632
IC50 226±n/a nM
Citation De Lombaert, STan, JStamford, LJSakane, YBerry, CGhai, RD Dual inhibition of neutral endopeptidase and angiotensin-converting enzyme by N-phosphonomethyl and N-carboxyalkyl dipeptides Bioorg Med Chem Lett4:2715-2720 (1994)    Article
 
Neprilysin
Name:Neprilysin
Type:Enzyme
Mol. Mass.:85505.38
Organism:Homo sapiens (Human)
Description:P08473
Residue:750
BDBM50283636
NameBDBM50283636
Synonyms:(S)-3-Biphenyl-4-yl-2-[(S)-3-(4-hydroxy-phenyl)-2-(phosphonomethyl-amino)-propionylamino]-propionic acid | CHEMBL420253
TypeSmall organic molecule
Emp. Form.C25H27N2O7P
Mol. Mass.498.4648
SMILESOC(=O)[C@H](Cc1ccc(cc1)-c1ccccc1)NC(=O)[C@H](Cc1ccc(O)cc1)NCP(O)(O)=O