Reaction Details
TargetNeprilysin
LigandBDBM50283649
Substrate/Competitorn/a
Meas. Tech.ChEBML_144632
IC50 35±n/a nM
Citation De Lombaert, STan, JStamford, LJSakane, YBerry, CGhai, RD Dual inhibition of neutral endopeptidase and angiotensin-converting enzyme by N-phosphonomethyl and N-carboxyalkyl dipeptides Bioorg Med Chem Lett4:2715-2720 (1994)    Article
 
Neprilysin
Name:Neprilysin
Type:Enzyme
Mol. Mass.:85505.38
Organism:Homo sapiens (Human)
Description:P08473
Residue:750
BDBM50283649
NameBDBM50283649
Synonyms:(S)-3-(4-Cyclohexyl-phenyl)-2-[(S)-3-methyl-2-(phosphonomethyl-amino)-butyrylamino]-propionic acid | CHEMBL93167
TypeSmall organic molecule
Emp. Form.C21H33N2O6P
Mol. Mass.440.4703
SMILESCC(C)[C@H](NCP(O)(O)=O)C(=O)N[C@@H](Cc1ccc(cc1)C1CCCCC1)C(O)=O