Reaction Details
TargetNeprilysin
LigandBDBM50283653
Substrate/Competitorn/a
Meas. Tech.ChEBML_144632
IC50 12±n/a nM
Citation De Lombaert, STan, JStamford, LJSakane, YBerry, CGhai, RD Dual inhibition of neutral endopeptidase and angiotensin-converting enzyme by N-phosphonomethyl and N-carboxyalkyl dipeptides Bioorg Med Chem Lett4:2715-2720 (1994)    Article
 
Neprilysin
Name:Neprilysin
Type:Enzyme
Mol. Mass.:85505.38
Organism:Homo sapiens (Human)
Description:P08473
Residue:750
BDBM50283653
NameBDBM50283653
Synonyms:1-{(S)-3-Biphenyl-4-yl-2-[(S)-3-methyl-1-oxo-2-(phosphonomethyl-amino)-butylamino]-propionyl}-4-hydroxy-pyrrolidine-2-carboxylic acid | CHEMBL329372
TypeSmall organic molecule
Emp. Form.C26H34N3O8P
Mol. Mass.547.5372
SMILESCC(C)[C@H](NCP(O)(O)=O)C(=O)N[C@@H](Cc1ccc(cc1)-c1ccccc1)C(=O)N1C[C@H](O)C[C@H]1C(O)=O